aérophone à anche libre
created: 2012-05-16T00:00:00+02:00
modified: 2014-10-10T11:29:29+02:00
status: 1
type: Concept
alternative label: cécilium
broader: T69-9890
definition: Instrument dont le son est obtenu par la mise en vibration d'une ou plusieurs languettes métalliques fixées, par vis ou rivets, sur un châssis métallique dont l'ouverture (dans laquelle l'anche peuvent vibrer) est ajustée.
in scheme: T69
narrower: T69-5094
narrower: T69-5096
narrower: T69-5098
narrower: T69-9884
preferred label: free reeds @en-us