harmonica
created: 2012-05-16T00:00:00+02:00
modified: 2014-10-10T11:30:41+02:00
status: 1
type: Concept
broader: T69-5093
definition: Instrument dont les anches sont disposées dans une petite boîte rectangulaire ; on en joue en inspirant ou en expirant, et en déplaçant l'instrument le long des lèvres.
in scheme: T69
preferred label: harmonicas @en-us