flageolet
created: 2012-05-16T00:00:00+02:00
modified: 2014-10-10T11:52:13+02:00
status: 1
type: Concept
broader: T69-5101
definition: Petite flûte à bec avec deux trous au revers pour les pouces et quatre sur la face antérieure pour les autres doigts.
in scheme: T69
preferred label: flageolets @en-us