flûte de Pan
created: 2012-05-16T00:00:00+02:00
modified: 2014-10-10T11:53:40+02:00
status: 1
type: Concept
alternative label: syrinx
broader: T69-5101
definition: Instrument à embouchure terminale qui comprend un nombre variable de tuyaux de longueur croissante.
in scheme: T69
preferred label: panpipes @en-us