sifflet
created: 2012-05-16T00:00:00+02:00
modified: 2014-12-12T16:40:01+01:00
status: 1
type: Concept
alternative label: sifflet à eau
broader: T69-5101
definition: Petit instrument à conduit d'air aménagé entre l'embouchure et le biseau, à un seul trou ou même sans trou, qui peut être réalisé dans des matériaux divers, bois, métal, argile, verre, etc.
in scheme: T69
preferred label: whistles @en-us