aérophone à anche vibrante double
created: 2012-05-16T00:00:00+02:00
modified: 2014-10-10T11:39:16+02:00
status: 1
type: Concept
alternative label: sarrusophone
broad match: http://data.bnf.fr/ark:/12148/cb16686981f
broader: T69-9890
definition: Instrument à vent utilisant un système d'anche (en roseau ou matériau composite) où l'air met en vibration deux languettes battant l'une contre l'autre.
in scheme: T69
narrower: T69-5117
narrower: T69-5119
narrower: T69-5121
narrower: T69-5125
narrower: T69-5127
preferred label: reedpipes with double reed @en-us