chalemie
created: 2012-05-16T00:00:00+02:00
modified: 2014-10-10T11:40:33+02:00
status: 1
type: Concept
alternative label: bombarde (instrument)
alternative label: chelemelle
broader: T69-5116
definition: Instrument de dimensions variées, ancêtre du hautbois, tourné dans une seule pièce avec une perce conique. La bombarde est une chalemie grave.
in scheme: T69
preferred label: shawns @en-us