cromorne
created: 2012-05-16T00:00:00+02:00
modified: 2014-10-10T11:42:07+02:00
status: 1
type: Concept
alternative label: tournebout
broader: T69-5116
definition: Instrument en bois en forme de J, à huit trous sur l'avers et un au revers. L'anche est enfermée dans une sorte de capsule (cuivret) qui interdit le contact direct avec les lèvres.
in scheme: T69
preferred label: crumhorns @en-us