chalumeau
created: 2012-05-16T00:00:00+02:00
modified: 2014-10-10T11:44:58+02:00
status: 1
type: Concept
broader: T69-5128
definition: Ancêtre de la clarinette, cet instrument sans pavillon est difficile à reconnaître car extérieurement proche de la flûte à bec, bien qu'il possède une anche.
in scheme: T69
preferred label: chalumeaux @en-us