édicule et mobilier de jardin
created: 2012-05-16T00:00:00+02:00
modified: 2015-02-24T10:47:33+01:00
status: 1
type: Concept
broader: T69-363
definition: Meuble, objet ou construction autonome et non habitable situé dans un jardin et servant à décorer, éclairer, s’asseoir, se divertir, etc.
in scheme: T69
narrower: T69-3484
narrower: T69-519
narrower: T69-6712
narrower: T69-6714
narrower: T69-6715
narrower: T69-6716