trompette naturelle
created: 2012-05-16T00:00:00+02:00
modified: 2014-10-10T12:12:56+02:00
status: 1
type: Concept
broad match: http://vocab.getty.edu/aat/300041639
broader: T69-9892
definition: Instrument à vent dont le corps sonore est mis en vibration par l'envoi d'un flux d'air dans l'embouchure.
in scheme: T69
narrower: T69-5136
narrower: T69-5138
narrower: T69-5140
narrower: T69-5144
narrower: T69-5146
preferred label: lip-vibrated aerophones with conical bore : natural @en-us