bugle
created: 2012-05-16T00:00:00+02:00
modified: 2014-12-15T10:52:42+01:00
status: 1
type: Concept
alternative label: clairon
broader: T69-5135
definition: Instrument en cuivre de forme compacte, à perce large et conique et tuyau enroulé sur lui-même. De fonction essentiellement militaire, il possède quelquefois des pistons ou des clés. Le clairon, sans pistons, est utilisé dans les fanfares militaires.
in scheme: T69
preferred label: bugles (valveless aerophones) @en-us