conque marine
created: 2012-05-16T00:00:00+02:00
modified: 2014-12-15T10:54:41+01:00
status: 1
type: Concept
broad match: http://vocab.getty.edu/aat/300224127
broader: T69-5135
definition: Coquille marine aménagée et utilisée par les bergers pour rassembler les troupeaux. Son embouchure est pratiquée dans la spirale du coquillage.
in scheme: T69
preferred label: conchs (trumpets) @en-us