olifant
created: 2012-05-16T00:00:00+02:00
modified: 2014-12-15T11:08:58+01:00
status: 1
type: Concept
broader: T69-5140
definition: Instrument particulièrement rare, constitué par une défense d'éléphant évidée, souvent décorée de motifs en relief et comportant une monture en métal précieux.
in scheme: T69
preferred label: oliphants @en-us
preferred label: olifante @it