trompe
created: 2012-05-16T00:00:00+02:00
modified: 2014-10-10T12:21:23+02:00
status: 1
type: Concept
alternative label: trompe d'appel
broad match: http://data.bnf.fr/ark:/12148/cb16687219b
broader: T69-5135
definition: Instrument en terre cuite ou en faïence imitant une corne ou un oliphant. Il est plutôt destiné à l'appel qu'à la musique proprement dite.
in scheme: T69