trompette chromatique
created: 2012-05-16T00:00:00+02:00
modified: 2014-10-10T12:11:03+02:00
status: 1
type: Concept
alternative label: saxhorn
broader: T69-9892
definition: Instrument à vent dont le corps sonore est mis en vibration par l'envoi d'un flux d'air dans l'embouchure. Il est muni d'un système de chromatisation (trous, pistons, clés ou coulisse) permettant d'introduire des notes intermédiaires (demi-tons), aux cinq tons de l'échelle diatonique.
in scheme: T69
narrower: T69-5149
narrower: T69-5153
narrower: T69-5157
narrower: T69-5159
narrower: T69-5161
narrower: T69-5163
narrower: T69-5165