cor à pistons
created: 2012-05-16T00:00:00+02:00
modified: 2014-10-10T12:00:26+02:00
status: 1
type: Concept
alternative label: cor d'harmonie
broader: T69-5148
definition: Instrument constitué d'un tuyau en cuivre, enroulé sur lui-même comme le cor et muni de pistons.
in scheme: T69
preferred label: French horns @en-us