ophicléide
created: 2012-05-16T00:00:00+02:00
modified: 2014-12-15T10:47:05+01:00
status: 1
type: Concept
alternative label: basse d'harmonie
alternative label: basson russe
alternative label: contrebasse d'harmonie
broader: T69-5148
definition: Instrument en cuivre muni généralement de onze clés. Constitué d'un long tuyau replié sur lui-même, il a la forme d'un U étroit. Le basson russe est en bois et peut avoir une embouchure zoomorphe.
in scheme: T69
preferred label: ophicleides @en-us