trombone
created: 2012-05-16T00:00:00+02:00
modified: 2014-12-15T10:48:04+01:00
status: 1
type: Concept
alternative label: sacqueboute
alternative label: trombone à coulisse
alternative label: trombone à pistons
broader: T69-5148
definition: Instrument en cuivre dessinant un S dont l'embouchure est en forme de cuvette et le pavillon évasé. Dans le trombone à coulisse, la hauteur du son varie en fonction de la position de la coulisse télescopique qui est remplacée par des pistons dans le trombone à pistons.
in scheme: T69
preferred label: trombones (trumpets) @en-us