instrument pouvant combiner plusieurs systèmes d'émission
created: 2012-05-16T00:00:00+02:00
modified: 2014-10-10T14:39:51+02:00
status: 1
type: Concept
alternative label: batterie (musique)
alternative label: harmonicorde
alternative label: piano organisé
broad match: http://data.bnf.fr/ark:/12148/cb119367821
broad match: Instrument de musique
broader: T69-4936
definition: Instrument mixte combinant plusieurs systèmes d’émission et plusieurs corps sonores comme, par exemple, des cordes frappées et des tuyaux (piano organisé), des anches libres et des lames métalliques percutées (harmonium à célesta), des anches libres et des cordes frappées (harmonicorde), etc.
in scheme: T69
preferred label: combination instruments @en-us