orgue
created: 2012-05-16T00:00:00+02:00
modified: 2014-12-15T11:14:40+01:00
status: 1
type: Concept
alternative label: grand orgue
alternative label: orgue de chœur
alternative label: orgue de tribune
alternative label: orgue monumental
broader: T69-9893
definition: Instrument, formé d'une ou plusieurs rangées de tuyaux de taille croissante, dans lesquels l'air, issu d’une soufflerie, est mis en vibration par l’intermédiaire d’un mécanisme commandé par un ou plusieurs claviers, pour produire les sons. La partie instrumentale de l'orgue est contenue dans une structure en bois, le buffet d'orgue.
in scheme: T69
narrower: T69-5172
narrower: T69-5174
preferred label: organs (aerophones) @en-us
preferred label: organo @it