partie instrumentale de l'orgue
created: 2012-05-16T00:00:00+02:00
modified: 2014-12-15T11:19:05+01:00
status: 1
type: Concept
broad match: Orgue
broad match: http://vocab.getty.edu/aat/300262415
broader: T69-5168
definition: Ensemble constitué de l’appareil sonore (sommiers et séries de tuyaux formant les jeux), des mécaniques de transmission des notes et des jeux, de la console (claviers et commandes de jeux ou registres), enfin de la soufflerie et de ses porte-vent. Les tuyaux, en bois, en plomb, en étain ou en zinc, sont disposés par ensemble (plans sonores : grand-orgue, positif, récit, écho, bombarde, pédale). Ils sont placés sur les sommiers, caisses en bois munies de soupapes d’admission et renfermant l'air sous pression. Celui-ci est produit par une soufflerie mécanique ou électrique, en général installée dans le soubassement. Dans les édifices cultuels, le grand orgue, généralement placé en tribune, intervient comme instrument soliste à différents moments de la liturgie (entrée, élévation, communion, sortie). L’organiste y exécute les pièces d’un répertoire spécifique ou improvise. L’orgue de chœur, de taille plus restreinte, accompagne les chants liturgiques.
in scheme: T69