orgue mécanique
created: 2012-05-16T00:00:00+02:00
modified: 2014-12-15T11:21:57+01:00
status: 1
type: Concept
alternative label: limonaire
alternative label: merline
alternative label: orgue de Barbarie
alternative label: orgue de danse
alternative label: orgue de foire
alternative label: perroquette
alternative label: serinette
broader: T69-9893
definition: Instrument à lame vibrante et/ou à tuyauterie, fonctionnant selon les mêmes principes que l'orgue. Il est cependant doté d'un système de reproduction mécanique (à cylindres de métal et/ou cartons perforés) sur lequel est notée la partition et actionné par une manivelle.
in scheme: T69
narrow match: Orgue de Barbarie
preferred label: barrel organs (organs) @en-us