accessoire du musicien
created: 2012-05-16T00:00:00+02:00
modified: 2014-10-10T11:19:50+02:00
status: 1
type: Concept
broad match: http://data.bnf.fr/ark:/12148/cb119367821
broad match: Instrument de musique
broader: T69-4936
definition: Elément nécessaire au musicien, complémentaire de son instrument.
in scheme: T69
narrower: T69-5181
narrower: T69-5183
narrower: T69-5185
narrower: T69-5187
narrower: T69-5189
narrower: T69-5191
preferred label: equipment for music @en-us