archet
created: 2012-05-16T00:00:00+02:00
modified: 2014-12-12T15:19:39+01:00
status: 1
type: Concept
broader: T69-5180
definition: Baguette, droite depuis le XVIIIe siècle, en bois dur, sur laquelle est tendue une mèche de crins ou de fibres artificielles avec laquelle on fait vibrer les cordes de différents instruments.
in scheme: T69
preferred label: bows (chordophone components) @en-us