baguette
terme associe: T69-4953
terme associe: T69-4954
terme associe: T69-4959
terme associe: T69-4963
terme associe: T69-4965
terme associe: T69-5005
terme associe: T69-5007
created: 2012-05-16T00:00:00+02:00
modified: 2014-10-10T11:22:10+02:00
status: 1
type: Concept
alternative label: mailloche
broader: T69-5180
definition: Petit bâton mince, plus ou moins flexible, avec lequel on frappe sur différents instruments.
in scheme: T69
narrow match: http://vocab.getty.edu/aat/300042613
preferred label: drumsticks @en-us
related: T69-4953
related: T69-4954
related: T69-4959
related: T69-4963
related: T69-4965
related: T69-5005
related: T69-5007
scope note: On peut aussi utiliser un maillet ou une mailloche, baguette terminée par une boule garnie de peau, ou encore un marteau.