diapason
terme associe: T69-5209
created: 2012-05-16T00:00:00+02:00
modified: 2014-10-10T11:24:48+02:00
status: 1
type: Concept
alternative label: diapason à pompe
broader: T69-5180
definition: Instrument en acier, de petite taille et en forme de fourche à deux dents, qui donne le "la" de l'octave moyenne lorsqu'on le fait vibrer. Le diapason à pompe est une sorte de flûte à bec qui permettait de donner la notre aux musiciens ou aux chanteurs.
in scheme: T69
preferred label: tuning forks @en-us
related: T69-5209