jeu de jardin
created: 2012-05-16T00:00:00+02:00
modified: 2014-10-15T16:02:59+02:00
status: 1
type: Concept
broad match: http://vocab.getty.edu/aat/300069657
broader: T69-512
definition: Equipement ou mobilier destiné au divertissement, au jeu d’adresse ou de hasard.
in scheme: T69