instrument de démonstration de phénomènes physiques
created: 2012-05-16T00:00:00+02:00
modified: 2014-10-23T15:38:02+02:00
status: 1
type: Concept
broader: T69-5193
definition: Instrument scientifique destiné à la vérification ou à la mise en évidence de phénomènes physiques, dans le cadre de cours ou d'enseignements individuels ou collectifs.
in scheme: T69
narrower: T69-5209
narrower: T69-5211
narrower: T69-5217
narrower: T69-5219
narrower: T69-5221
narrower: T69-5235