instrument de démonstration en acoustique
terme associe: T69-5189
terme associe: T69-6080
created: 2012-05-16T00:00:00+02:00
modified: 2014-12-15T14:08:31+01:00
status: 1
type: Concept
broader: T69-5207
definition: Instrument scientifique destiné à la mise en évidence de phénomènes liés à l'acoustique, ou étude de mouvements ondulatoires mécaniques.
in scheme: T69
related: T69-5189
related: T69-6080