instrument de démonstration en électrostatique
terme associe: T69-6102
created: 2012-05-16T00:00:00+02:00
modified: 2014-12-15T14:12:12+01:00
status: 1
type: Concept
alternative label: cage de Faraday
alternative label: carreau étincelant
alternative label: paratonnerre de Franklin
alternative label: perce-carte
alternative label: pistolet de Volta
alternative label: tube étincelant
alternative label: électroscope
broad match: http://vocab.getty.edu/aat/300122283
broader: T69-5207
definition: Instrument de mise en évidence des phénomènes électrostatiques et de leurs effets lumineux ou mécaniques.
in scheme: T69
narrow match: Cage de Faraday
related: T69-6102