instrument de démonstration en électrodynamique
created: 2012-05-16T00:00:00+02:00
modified: 2014-12-15T14:09:51+01:00
status: 1
type: Concept
alternative label: bobine d'induction
alternative label: disque de Foucault
alternative label: roue de Barlow
alternative label: œuf électrique
broad match: http://vocab.getty.edu/aat/300122283
broader: T69-5207
definition: Instrument de mise en évidence des phénomènes d'électricité dynamique, et notamment de l'action et des propriétés (magnétiques, motrices) des courants.
in scheme: T69
narrow match: http://data.bnf.fr/ark:/12148/cb12337785d
narrow match: Roue de Barlow