instrument de démonstration en mécanique des solides
created: 2012-05-16T00:00:00+02:00
modified: 2014-10-23T16:05:31+02:00
status: 1
type: Concept
broad match: http://vocab.getty.edu/aat/300122283
broader: T69-5221
definition: Instrument de mise en évidence et d'étude des phénomènes liés à la statique et à la dynamique.
in scheme: T69
narrower: T69-5225
narrower: T69-5227