instrument de démonstration en dynamique des fluides
created: 2012-05-16T00:00:00+02:00
modified: 2014-12-15T14:16:02+01:00
status: 1
type: Concept
alternative label: fontaine intermittente
broad match: http://vocab.getty.edu/aat/300122283
broader: T69-5229
definition: Instrument d'étude des propriétés des fluides en mouvement.
in scheme: T69