instrument de démonstration en optique
created: 2012-05-16T00:00:00+02:00
modified: 2014-12-15T14:23:20+01:00
status: 1
type: Concept
alternative label: disque de Newton
alternative label: miroir ardent
alternative label: miroir double par réflexion infinie
alternative label: polyprisme
alternative label: prisme creux
alternative label: prisme à angle variable
alternative label: œil artificiel
broader: T69-5207
definition: Instrument de démonstration des phénomènes liés à l'optique : réflexion, réfraction, spectroscopie, polarisation.
in scheme: T69
narrow match: http://data.bnf.fr/ark:/12148/cb119582847
narrow match: Disque de Newton
narrow match: http://vocab.getty.edu/aat/300266644