instrument de mesure de la déclinaison magnétique
created: 2012-05-16T00:00:00+02:00
modified: 2014-12-15T14:51:32+01:00
status: 1
type: Concept
alternative label: boussole de déclinaison
alternative label: compas de marine
broader: T69-5261
definition: En géomagnétisme, instrument de mesure de l'angle (ou de ses variations) entre le plan du méridien magnétique et le plan magnétique géographique du lieu, à un instant donné.
in scheme: T69
narrow match: Compas (navigation)