instrument de mesure des angles en optique
created: 2012-05-16T00:00:00+02:00
modified: 2014-12-15T14:53:24+01:00
status: 1
type: Concept
broad match: http://data.bnf.fr/ark:/12148/cb119324889
broad match: http://vocab.getty.edu/aat/300195806
broader: T69-5249
definition: Instrument de mesure des angles de réfractions et de polarisations des rayons lumineux.
in scheme: T69
narrower: T69-5275
narrower: T69-5278