instrument de mesure des angles de polarisation
created: 2012-05-16T00:00:00+02:00
modified: 2014-12-15T14:54:39+01:00
status: 1
type: Concept
alternative label: polarimètre
alternative label: polariscope
alternative label: saccharimètre
broad match: http://data.bnf.fr/ark:/12148/cb119324889
broad match: http://vocab.getty.edu/aat/300195806
broader: T69-5273
definition: Instrument permettant de repérer et/ou mesurer l'angle résultant de l'action d'un corps sur le plan de polarisation d'un rayon lumineux.
in scheme: T69
narrow match: Polarimètre