instrument de mesure des longueurs
terme associe: T69-9658
created: 2012-05-16T00:00:00+02:00
modified: 2014-12-15T15:14:14+01:00
status: 1
type: Concept
alternative label: altimètre
alternative label: bathimètre
alternative label: cathétomètre
alternative label: focomètre
alternative label: interféromètre
alternative label: micromètre
alternative label: pied à coulisse
alternative label: sphéromètre
alternative label: tachéomètre
alternative label: télémètre
broader: T69-5247
definition: Instrument de mesure des distances entre deux ou plusieurs points (droites, courbes) sur un objet matériel ou sur une projection lumineuse, exprimée en sous-multiples et multiples du mètre, en toises, pieds, pouces et autres mesures d'Ancien Régime.
in scheme: T69
preferred label: linear distance measuring devices @en-us
related: T69-9658