instrument de mesure des masses
terme associe: T69-5479
created: 2012-05-16T00:00:00+02:00
modified: 2014-12-15T15:15:03+01:00
status: 1
type: Concept
broader: T69-5247
definition: Instrument de mesure des masses, servant à peser, au moyen d'un fléau mobile et de plateaux dont l'un porte la chose à peser, l'autre des masses marquées, ou avec une masse constante et mobile par rapport à son point de suspension. Les mesures sont exprimées en multiples et fractions de grammes, ou en unités d'Ancien Régime.
in scheme: T69
narrower: T69-5289
related: T69-5479