balance de précision
terme associe: T69-9674
created: 2012-05-16T00:00:00+02:00
modified: 2014-12-15T15:16:39+01:00
status: 1
type: Concept
alternative label: balance accélérée
alternative label: trébuchet (balance)
broader: T69-5287
definition: Appareil qui sert à faire connaître la masse d'un corps et qui se compose essentiellement d'un levier dont un bras porte le poids et l'autre l'objet que l'on veut peser.
in scheme: T69
preferred label: balances (scales) @en-us
related: T69-9674