thermomètre
created: 2012-05-16T00:00:00+02:00
modified: 2014-12-15T15:40:25+01:00
status: 1
type: Concept
alternative label: instrument de mesure de la température
alternative label: pyromètre
alternative label: thermoscope
broader: T69-5310
definition: Instrument de mesure ou de repérage de la dilatation, sous l'effet de la chaleur, d'un corps liquide, gazeux ou solide, ou de la déformation d'une bilame; instrument de recherche de la température par pesage d'une masse d'air emprisonnée à un instant choisi, ou par le contrôle d'une résistance électrique.
in scheme: T69
preferred label: thermometers @en-us