hygromètre
created: 2012-05-16T00:00:00+02:00
modified: 2014-12-15T15:37:48+01:00
status: 1
type: Concept
alternative label: instrument de mesure de l'hygrométrie
alternative label: psychromètre
broader: T69-5310
definition: Instrument de mesure du degré d'humidité de l'air, par absorption (souvent appareil de repérage ayant un caractère ludique), ou par condensation (donnant une mesure plus précise), et indirectement du point de rosée (psychromètre), déterminé par la capacité d'absorption de l'air, liée à sa température.
in scheme: T69
preferred label: hygrometers @en-us