instrument de mesure des quantités de chaleur
created: 2012-05-16T00:00:00+02:00
modified: 2014-12-15T15:38:47+01:00
status: 1
type: Concept
alternative label: calorimètre
broader: T69-5310
definition: Instrument mettant en évidence les quantités de chaleur absorbées ou dégagées lors d'une transformation physique, un changement d'état ou une réaction chimique. Exemple : appareil de Clément-Désormes.
in scheme: T69
preferred label: calorimeters @en-us