horloge
terme associe: T69-475
terme associe: T69-5323
created: 2012-05-16T00:00:00+02:00
modified: 2014-12-10T14:07:14+01:00
status: 1
type: Concept
alternative label: réveil-matin
broader: T69-8635
definition: Objet servant à indiquer les heures légales et très généralement les minutes, parfois les secondes (trotteuse). On parle d’horloge complexe lorsque l’objet permet également de connaître les jours de la semaine, les mois, les années, les équivalences horaires dans les diverses parties du monde, etc.
in scheme: T69
narrower: T69-3547
narrower: T69-5334
narrower: T69-5336
narrower: T69-5339
related: T69-475
related: T69-5323