instrument d'observation
created: 2012-05-16T00:00:00+02:00
modified: 2014-12-15T13:47:33+01:00
status: 1
type: Concept
alternative label: loupe
broad match: Instrument scientifique
broader: T69-5193
definition: Instrument scientifique (le plus souvent d'optique) destiné à rendre visible ou concevable un sujet impossible à étudier directement, et vu comme outil de travail pour l'expérimentateur en laboratoire ou en observatoire.
in scheme: T69
narrower: T69-5366
narrower: T69-5369
narrower: T69-5376
narrower: T69-5378