ferrure
created: 2012-05-16T00:00:00+02:00
modified: 2015-01-23T17:04:00+01:00
status: 1
type: Concept
alternative label: fausse penture
broader: T69-532
definition: Pièce de métal ayant pour fonction essentielle de consolider l'assemblage de menuiserie. Les ferrures à équerre, double équerre, en T ou double T, etc. sont le plus souvent à l'extérieur de l'ouvrage et les têtes ou les branches en sont ornées pour obtenir un effet décoratif.
in scheme: T69
preferred label: door and window hardware @en-us