lunette astronomique
created: 2012-05-16T00:00:00+02:00
modified: 2014-12-15T13:56:11+01:00
status: 1
type: Concept
broader: T69-5369
definition: Lunette destinée à l'observation des astres et qui fournit des images non redressées. La lunette astronomique se compose d'un objectif et d'un oculaire, constitués l'un et l'autre par un système de lentilles (à la différence du télescope, dont l'objectif est un miroir).
in scheme: T69