longue-vue
created: 2012-05-16T00:00:00+02:00
modified: 2014-12-15T13:53:10+01:00
status: 1
type: Concept
alternative label: jumelles
alternative label: lunette marine
alternative label: lunette terrestre
alternative label: périscope
broad match: cb11936397z
broader: T69-5369
definition: Lunette d'approche destinée à l'observation terrestre ou marine et qui fournit des images redressée. La longue-vue se compose d'un objectif, d'un oculaire, constitués l'un et l'autre par un système de lentilles, et d'un système optique permettant de redresser l'image.
in scheme: T69