penture
created: 2012-05-16T00:00:00+02:00
modified: 2015-01-29T17:19:43+01:00
status: 1
type: Concept
alternative label: charnière à penture
broader: T69-532
definition: Bande de métal fixée à plat sur le vantail d'une porte ou d'un volet, de manière à l'articuler sur le gond. La penture assure la rotation d'un panneau ouvrant tout en permettant éventuellement de consolider ses assemblages.
in scheme: T69
preferred label: strap hinges @en-us